Reaction Details
TargetP2Y purinoceptor 4
LigandBDBM50237577
Substrate/Competitorn/a
Meas. Tech.ChEMBL_1661636 (CHEMBL4011248)
IC50 233±n/a nM
Citation Rafehi, MMalik, EMNeumann, AAbdelrahman, AHanck, TNamasivayam, VMüller, CEBaqi, Y Development of Potent and Selective Antagonists for the UTP-Activated P2Y J Med Chem60:3020-3038 (2017) 
 
P2Y purinoceptor 4
Name:P2Y purinoceptor 4
Type:PROTEIN
Mol. Mass.:40977.17
Organism:Homo sapiens (Human)
Description:ChEMBL_751027
Residue:365
BDBM50237577
NameBDBM50237577
Synonyms:CHEMBL4087247
TypeSmall organic molecule
Emp. Form.C28H21N2NaO5S2
Mol. Mass.552.597
SMILES[Na+].Cc1ccc(Sc2ccc(Nc3cc(c(N)c4C(=O)c5ccccc5C(=O)c34)S([O-])(=O)=O)cc2)c(C)c1