Reaction Details
TargetBile salt export pump
LigandBDBM50042235
Substrate/Competitorn/a
Meas. Tech.ChEMBL_1661992 (CHEMBL4011673)
IC50 7310±n/a nM
Citation Aleo, MDLuo, YSwiss, RBonin, PDPotter, DMWill, Y Human drug-induced liver injury severity is highly associated with dual inhibition of liver mitochondrial function and bile salt export pump. Hepatology60:1015-22 (2014) 
 
Bile salt export pump
Name:Bile salt export pump
Type:Protein
Mol. Mass.:146405.49
Organism:Homo sapiens (Human)
Description:O95342
Residue:1321
BDBM50042235
NameBDBM50042235
Synonyms:2-butyl-3-{[2'-(1H-tetrazol-5-yl)[1,1'-biphenyl]-4-yl]methyl}-1,3-diazaspiro[4.4]non-1-en-4-one BMS 186295 IRBESARTAN
TypeSmall organic molecule
Emp. Form.C25H28N6O
Mol. Mass.428.5294
SMILESCCCCC1=NC2(CCCC2)C(=O)N1Cc1ccc(cc1)-c1ccccc1-c1nnn[nH]1