Reaction Details
TargetBile salt export pump
LigandBDBM50101815
Substrate/Competitorn/a
Meas. Tech.ChEMBL_1661991 (CHEMBL4011672)
IC50 7900±n/a nM
Citation Aleo, MDLuo, YSwiss, RBonin, PDPotter, DMWill, Y Human drug-induced liver injury severity is highly associated with dual inhibition of liver mitochondrial function and bile salt export pump. Hepatology60:1015-22 (2014) 
 
Bile salt export pump
Name:Bile salt export pump
Type:Protein
Mol. Mass.:146405.49
Organism:Homo sapiens (Human)
Description:O95342
Residue:1321
BDBM50101815
NameBDBM50101815
Synonyms:CHEBI:7550 | Nicardipine
TypeSmall organic molecule
Emp. Form.C26H29N3O6
Mol. Mass.479.525
SMILESCOC(=O)C1=C(C)NC(C)=C(C1c1cccc(c1)[N+]([O-])=O)C(=O)OCCN(C)Cc1ccccc1