Reaction Details
TargetE3 ubiquitin-protein ligase Mdm2
LigandBDBM50237768
Substrate/Competitorn/a
Meas. Tech.ChEMBL_1661768 (CHEMBL4011380)
Ki 1±n/a nM
Citation Aguilar, ALu, JLiu, LDu, DBernard, DMcEachern, DPrzybranowski, SLi, XLuo, RWen, BSun, DWang, HWen, JWang, GZhai, YGuo, MYang, DWang, S Discovery of 4-((3'R,4'S,5'R)-6¿-Chloro-4'-(3-chloro-2-fluorophenyl)-1'-ethyl-2¿-oxodispiro[cyclohexane-1,2'-pyrrolidine-3',3¿-indoline]-5'-carboxamido)bicyclo[2.2.2]octane-1-carboxylic Acid (AA-115/APG-115): A Potent and Orally Active Murine Double Minute 2 (MDM2) Inhibitor in Clinical Deve J Med Chem60:2819-2839 (2017) 
 
E3 ubiquitin-protein ligase Mdm2
Name:E3 ubiquitin-protein ligase Mdm2
Type:Oncoprotein
Mol. Mass.:55196.54
Organism:Homo sapiens (Human)
Description:Q00987
Residue:491
BDBM50237768
NameBDBM50237768
Synonyms:CHEMBL4063804
TypeSmall organic molecule
Emp. Form.C27H24Cl2FN3O3S
Mol. Mass.560.467
SMILESCN1[C@H]([C@H](c2cccc(Cl)c2F)[C@]2(C(=O)Nc3cc(Cl)ccc23)C11CCCCC1)c1nc(cs1)C(O)=O