Reaction Details
TargetAurora kinase B
LigandBDBM14210
Substrate/Competitorn/a
Meas. Tech.ChEMBL_1662115 (CHEMBL4011796)
IC50 156±n/a nM
Citation Zheng, YGSu, JGao, CYJiang, PAn, LXue, YSGao, JLiu, Y Design, synthesis, and biological evaluation of novel 4-anilinoquinazoline derivatives bearing amino acid moiety as potential EGFR kinase inhibitors. Eur J Med Chem130:393-405 (2017) 
 
Aurora kinase B
Name:Aurora kinase B
Type:Protein
Mol. Mass.:39327.72
Organism:Homo sapiens (Human)
Description:Q96GD4
Residue:344
BDBM14210
NameBDBM14210
Synonyms:4-(4-(N-benzoylamino)anilino)-6-methoxy-7-(3-(1-morpholino)propoxy)-quinazoline N-[4-({6-methoxy-7-[3-(morpholin-4-yl)propoxy]quinazolin-4-yl}amino)phenyl]benzamide | ZM447439
TypeSmall organic molecule
Emp. Form.C29H31N5O4
Mol. Mass.513.5875
SMILESCOc1cc2c(Nc3ccc(NC(=O)c4ccccc4)cc3)ncnc2cc1OCCCN1CCOCC1