Reaction Details
TargetEpidermal growth factor receptor
LigandBDBM50237567
Substrate/Competitorn/a
Meas. Tech.ChEMBL_1662113 (CHEMBL4011794)
IC50 1021±n/a nM
Citation Zheng, YGSu, JGao, CYJiang, PAn, LXue, YSGao, JLiu, Y Design, synthesis, and biological evaluation of novel 4-anilinoquinazoline derivatives bearing amino acid moiety as potential EGFR kinase inhibitors. Eur J Med Chem130:393-405 (2017) 
 
Epidermal growth factor receptor
Name:Epidermal growth factor receptor
Type:Receptor Kinase Domain
Mol. Mass.:134279.59
Organism:Homo sapiens (Human)
Description:P00533
Residue:1210
BDBM50237567
NameBDBM50237567
Synonyms:CHEMBL4092491
TypeSmall organic molecule
Emp. Form.C25H28F3N5O3
Mol. Mass.503.5167
SMILESCC(C)[C@@H](NC(=O)OC(C)(C)C)C(=O)Nc1ccc2ncnc(Nc3cccc(c3)C(F)(F)F)c2c1