Reaction Details
TargetAurora kinase B
LigandBDBM50237553
Substrate/Competitorn/a
Meas. Tech.ChEMBL_1662115 (CHEMBL4011796)
IC50 6200±n/a nM
Citation Zheng, YGSu, JGao, CYJiang, PAn, LXue, YSGao, JLiu, Y Design, synthesis, and biological evaluation of novel 4-anilinoquinazoline derivatives bearing amino acid moiety as potential EGFR kinase inhibitors. Eur J Med Chem130:393-405 (2017) 
 
Aurora kinase B
Name:Aurora kinase B
Type:Protein
Mol. Mass.:39327.72
Organism:Homo sapiens (Human)
Description:Q96GD4
Residue:344
BDBM50237553
NameBDBM50237553
Synonyms:CHEMBL4071058
TypeSmall organic molecule
Emp. Form.C21H22BrN5O3
Mol. Mass.472.335
SMILESCC(C)(C)OC(=O)NCC(=O)Nc1ccc2ncnc(Nc3cccc(Br)c3)c2c1