Reaction Details
TargetAndrogen receptor
LigandBDBM50238124
Substrate/Competitorn/a
Meas. Tech.ChEMBL_1662819 (CHEMBL4012500)
IC50 0.490000±n/a nM
Citation Asano, MHitaka, TImada, TYamada, MMorimoto, MShinohara, HHara, TYamaoka, MSantou, TNakayama, MImai, YHabuka, NYano, JWilson, KFujita, HHasuoka, A Synthesis and biological evaluation of novel selective androgen receptor modulators (SARMs). Part II: Optimization of 4-(pyrrolidin-1-yl)benzonitrile derivatives. Bioorg Med Chem Lett27:1897-1901 (2017) 
 
Androgen receptor
Name:Androgen receptor
Type:Receptor
Mol. Mass.:99185.27
Organism:Homo sapiens (Human)
Description:CHO cells were stably transfected with human AR gene.
Residue:920
BDBM50238124
NameBDBM50238124
Synonyms:CHEMBL4060271
TypeSmall organic molecule
Emp. Form.C14H17ClN2O
Mol. Mass.264.751
SMILESC[C@@H]1N(CC[C@]1(C)O)c1ccc(C#N)c(Cl)c1C