Reaction Details
TargetCollagenase 3
LigandBDBM194645
Substrate/Competitorn/a
Meas. Tech.ChEMBL_1663589 (CHEMBL4013270)
IC50>100000±n/a nM
Citation Durham, TBMarimuthu, JToth, JLLiu, CAdams, LMudra, DRSwearingen, CLin, CChambers, MGThirunavukkarasu, KWiley, MR A Highly Selective Hydantoin Inhibitor of Aggrecanase-1 and Aggrecanase-2 with a Low Projected Human Dose. J Med Chem60:5933-5939 (2017) 
 
Collagenase 3
Name:Collagenase 3
Type:Enzyme
Mol. Mass.:53808.06
Organism:Homo sapiens (Human)
Description:P45452
Residue:471
BDBM194645
NameBDBM194645
Synonyms:US9206139, 4
TypeSmall organic molecule
Emp. Form.C20H24F3N3O3
Mol. Mass.411.4181
SMILESCC(C)[C@H](Cc1ccc(cc1)C(F)(F)F)C(=O)NC[C@]1(NC(=O)NC1=O)C1CC1