Reaction Details
TargetMatrix metalloproteinase-14
LigandBDBM50238241
Substrate/Competitorn/a
Meas. Tech.ChEMBL_1663590 (CHEMBL4013271)
IC50 3400±n/a nM
Citation Durham, TBMarimuthu, JToth, JLLiu, CAdams, LMudra, DRSwearingen, CLin, CChambers, MGThirunavukkarasu, KWiley, MR A Highly Selective Hydantoin Inhibitor of Aggrecanase-1 and Aggrecanase-2 with a Low Projected Human Dose. J Med Chem60:5933-5939 (2017) 
 
Matrix metalloproteinase-14
Name:Matrix metalloproteinase-14
Type:Protein
Mol. Mass.:65900.19
Organism:Homo sapiens (Human)
Description:P50281
Residue:582
BDBM50238241
NameBDBM50238241
Synonyms:CHEMBL4102193
TypeSmall organic molecule
Emp. Form.C17H18F3N3O3
Mol. Mass.369.3383
SMILESFC(F)(F)c1ccc(CCC(=O)NC[C@]2(NC(=O)NC2=O)C2CC2)cc1