Reaction Details
TargetMatrix metalloproteinase-14
LigandBDBM194638
Substrate/Competitorn/a
Meas. Tech.ChEMBL_1663590 (CHEMBL4013271)
IC50 3900±n/a nM
Citation Durham, TBMarimuthu, JToth, JLLiu, CAdams, LMudra, DRSwearingen, CLin, CChambers, MGThirunavukkarasu, KWiley, MR A Highly Selective Hydantoin Inhibitor of Aggrecanase-1 and Aggrecanase-2 with a Low Projected Human Dose. J Med Chem60:5933-5939 (2017) 
 
Matrix metalloproteinase-14
Name:Matrix metalloproteinase-14
Type:Protein
Mol. Mass.:65900.19
Organism:Homo sapiens (Human)
Description:P50281
Residue:582
BDBM194638
NameBDBM194638
Synonyms:US9206139, 1
TypeSmall organic molecule
Emp. Form.C18H20F3N3O3
Mol. Mass.383.3649
SMILESC[C@H](Cc1ccc(cc1)C(F)(F)F)C(=O)NC[C@]1(NC(=O)NC1=O)C1CC1