Reaction Details
TargetMacrophage metalloelastase
LigandBDBM50238241
Substrate/Competitorn/a
Meas. Tech.ChEMBL_1663588 (CHEMBL4013269)
IC50 5.0±n/a nM
Citation Durham, TBMarimuthu, JToth, JLLiu, CAdams, LMudra, DRSwearingen, CLin, CChambers, MGThirunavukkarasu, KWiley, MR A Highly Selective Hydantoin Inhibitor of Aggrecanase-1 and Aggrecanase-2 with a Low Projected Human Dose. J Med Chem60:5933-5939 (2017) 
 
Macrophage metalloelastase
Name:Macrophage metalloelastase
Type:Enzyme
Mol. Mass.:54012.99
Organism:Homo sapiens (Human)
Description:P39900
Residue:470
BDBM50238241
NameBDBM50238241
Synonyms:CHEMBL4102193
TypeSmall organic molecule
Emp. Form.C17H18F3N3O3
Mol. Mass.369.3383
SMILESFC(F)(F)c1ccc(CCC(=O)NC[C@]2(NC(=O)NC2=O)C2CC2)cc1