Reaction Details
TargetMast/stem cell growth factor receptor Kit
LigandBDBM50238307
Substrate/Competitorn/a
Meas. Tech.ChEMBL_1662941 (CHEMBL4012622)
IC50 1.7±n/a nM
Citation Lu, YMao, FLi, XZheng, XWang, MXu, QZhu, JLi, J Discovery of Potent, Selective Stem Cell Factor Receptor/Platelet Derived Growth Factor Receptor Alpha (c-KIT/PDGFRa) Dual Inhibitor for the Treatment of Imatinib-Resistant Gastrointestinal Stromal Tumors (GISTs). J Med Chem60:5099-5119 (2017) 
 
Mast/stem cell growth factor receptor Kit
Name:Mast/stem cell growth factor receptor Kit
Type:Protein
Mol. Mass.:109869.37
Organism:Homo sapiens (Human)
Description:P10721
Residue:976
BDBM50238307
NameBDBM50238307
Synonyms:CHEMBL4101428
TypeSmall organic molecule
Emp. Form.C23H23N5O
Mol. Mass.385.4616
SMILESCc1n[nH]c2nccc(-c3ccc(NC(=O)NCCCc4ccccc4)cc3)c12