Reaction Details
TargetAdenosine receptor A3
LigandBDBM21220
Substrate/Competitorn/a
Meas. Tech.ChEMBL_1663192 (CHEMBL4012873)
Ki 13±n/a nM
Citation Falsini, MSquarcialupi, LCatarzi, DVarano, FBetti, MDal Ben, DMarucci, GBuccioni, MVolpini, RDe Vita, TCavalli, AColotta, V The 1,2,4-Triazolo[4,3-a]pyrazin-3-one as a Versatile Scaffold for the Design of Potent Adenosine Human Receptor Antagonists. Structural Investigations to Target the A J Med Chem60:5772-5790 (2017) 
 
Adenosine receptor A3
Name:Adenosine receptor A3
Type:G Protein-Coupled Receptor (GPCR)
Mol. Mass.:36197.32
Organism:Homo sapiens (Human)
Description:P0DMS8
Residue:318
BDBM21220
NameBDBM21220
Synonyms:(2S,3S,4R,5R)-5-(6-amino-9H-purin-9-yl)-N-ethyl-3,4-dihydroxyoxolane-2-carboxamide Adenosine, N6-Ethyl-carboxamido CHEMBL464859 NECA
TypeAntineoplastic Agent
Emp. Form.C12H16N6O4
Mol. Mass.308.2932
SMILESCCNC(=O)[C@H]1O[C@H]([C@H](O)[C@@H]1O)n1cnc2c(N)ncnc12