Reaction Details
TargetAdenosine receptor A3
LigandBDBM50238389
Substrate/Competitorn/a
Meas. Tech.ChEMBL_1663192 (CHEMBL4012873)
Ki 650±n/a nM
Citation Falsini, MSquarcialupi, LCatarzi, DVarano, FBetti, MDal Ben, DMarucci, GBuccioni, MVolpini, RDe Vita, TCavalli, AColotta, V The 1,2,4-Triazolo[4,3-a]pyrazin-3-one as a Versatile Scaffold for the Design of Potent Adenosine Human Receptor Antagonists. Structural Investigations to Target the A J Med Chem60:5772-5790 (2017) 
 
Adenosine receptor A3
Name:Adenosine receptor A3
Type:G Protein-Coupled Receptor (GPCR)
Mol. Mass.:36197.32
Organism:Homo sapiens (Human)
Description:P0DMS8
Residue:318
BDBM50238389
NameBDBM50238389
Synonyms:CHEMBL4066559
TypeSmall organic molecule
Emp. Form.C17H14N6O
Mol. Mass.318.3327
SMILESNc1ccc(cc1)-n1nc2c(N)nc(cn2c1=O)-c1ccccc1