Reaction Details
TargetProto-oncogene tyrosine-protein kinase Src
LigandBDBM50238530
Substrate/Competitorn/a
Meas. Tech.ChEMBL_1663822 (CHEMBL4013503)
Ki>100000±n/a nM
Citation Vignaroli, GIovenitti, GZamperini, CConiglio, FCalandro, PMolinari, AFallacara, ALSartucci, ACalgani, AColecchia, DMancini, AFestuccia, CDreassi, EValoti, MMusumeci, FChiariello, MAngelucci, ABotta, MSchenone, S Prodrugs of Pyrazolo[3,4-d]pyrimidines: From Library Synthesis to Evaluation as Potential Anticancer Agents in an Orthotopic Glioblastoma Model. J Med Chem60:6305-6320 (2017) 
 
Proto-oncogene tyrosine-protein kinase Src
Name:Proto-oncogene tyrosine-protein kinase Src
Type:Protein
Mol. Mass.:59838.60
Organism:Homo sapiens (Human)
Description:P12931
Residue:536
BDBM50238530
NameBDBM50238530
Synonyms:CHEMBL4087882
TypeSmall organic molecule
Emp. Form.C33H40BrClN8O3S
Mol. Mass.744.144
SMILESCN1CCN(CCOC(=O)N(c2cccc(Br)c2)c2nc(SCCN3CCOCC3)nc3n(CC(Cl)c4ccccc4)ncc23)CC1