Reaction Details
TargetEstrogen receptor
LigandBDBM50238739
Substrate/Competitorn/a
Meas. Tech.ChEMBL_1664056 (CHEMBL4013737)
Ki 0.370000±n/a nM
Citation Min, JGuillen, VSSharma, AZhao, YZiegler, YGong, PMayne, CGSrinivasan, SKim, SHCarlson, KENettles, KWKatzenellenbogen, BSKatzenellenbogen, JA Adamantyl Antiestrogens with Novel Side Chains Reveal a Spectrum of Activities in Suppressing Estrogen Receptor Mediated Activities in Breast Cancer Cells. J Med Chem60:6321-6336 (2017) 
 
Estrogen receptor
Name:Estrogen receptor
Type:Protein
Mol. Mass.:66230.44
Organism:Homo sapiens (Human)
Description:P03372
Residue:595
BDBM50238739
NameBDBM50238739
Synonyms:CHEMBL4079644
TypeSmall organic molecule
Emp. Form.C28H30O4
Mol. Mass.430.5354
SMILESOCCOC(=O)\C=C\c1ccc(cc1)C(=C1C2CC3CC(C2)CC1C3)c1ccc(O)cc1