Reaction Details
Target5-hydroxytryptamine receptor 2C
LigandBDBM50238765
Substrate/Competitorn/a
Meas. Tech.ChEMBL_1664087 (CHEMBL4013768)
Ki 78±n/a nM
Citation Zhang, GCheng, JMcCorvy, JDLorello, PJCaldarone, BJRoth, BLKozikowski, AP Discovery of N-Substituted (2-Phenylcyclopropyl)methylamines as Functionally Selective Serotonin 2C Receptor Agonists for Potential Use as Antipsychotic Medications. J Med Chem60:6273-6288 (2017) 
 
5-hydroxytryptamine receptor 2C
Name:5-hydroxytryptamine receptor 2C
Type:G Protein-Coupled Receptor (GPCR)
Mol. Mass.:51836.79
Organism:Homo sapiens (Human)
Description:P28335
Residue:458
BDBM50238765
NameBDBM50238765
Synonyms:CHEMBL4072722
TypeSmall organic molecule
Emp. Form.C19H23ClFNO2
Mol. Mass.351.843
SMILESCl.COc1ccccc1CNC[C@H]1C[C@@H]1c1cc(F)ccc1OC