Reaction Details
TargetPotassium voltage-gated channel subfamily H member 2
LigandBDBM50238765
Substrate/Competitorn/a
Meas. Tech.ChEMBL_1664072 (CHEMBL4013753)
IC50 1400±n/a nM
Citation Zhang, GCheng, JMcCorvy, JDLorello, PJCaldarone, BJRoth, BLKozikowski, AP Discovery of N-Substituted (2-Phenylcyclopropyl)methylamines as Functionally Selective Serotonin 2C Receptor Agonists for Potential Use as Antipsychotic Medications. J Med Chem60:6273-6288 (2017) 
 
Potassium voltage-gated channel subfamily H member 2
Name:Potassium voltage-gated channel subfamily H member 2
Type:Multi-pass membrane protein
Mol. Mass.:126672.65
Organism:Homo sapiens (Human)
Description:Q12809
Residue:1159
BDBM50238765
NameBDBM50238765
Synonyms:CHEMBL4072722
TypeSmall organic molecule
Emp. Form.C19H23ClFNO2
Mol. Mass.351.843
SMILESCl.COc1ccccc1CNC[C@H]1C[C@@H]1c1cc(F)ccc1OC