Reaction Details
TargetN-formyl peptide receptor 2
LigandBDBM50238901
Substrate/Competitorn/a
Meas. Tech.ChEMBL_1664517 (CHEMBL4014198)
IC50 35±n/a nM
Citation Skovbakke, SLSkovbakke, SLSkovbakke, SLHoldfeldt, AHoldfeldt, AHoldfeldt, ANielsen, CNielsen, CNielsen, CHansen, AMHansen, AMHansen, AMPerez-Gassol, IPerez-Gassol, IPerez-Gassol, IDahlgren, CDahlgren, CDahlgren, CForsman, HForsman, HForsman, HFranzyk, HFranzyk, HFranzyk, H Combining Elements from Two Antagonists of Formyl Peptide Receptor 2 Generates More Potent Peptidomimetic Antagonists. J Med Chem60:6991-6997 (2017) 
 
N-formyl peptide receptor 2
Name:N-formyl peptide receptor 2
Type:G Protein-Coupled Receptor (GPCR)
Mol. Mass.:38968.35
Organism:Homo sapiens (Human)
Description:P25090
Residue:351
BDBM50238901
NameBDBM50238901
Synonyms:CHEMBL4072333
TypeSmall organic molecule
Emp. Form.C140H193N24O16
Mol. Mass.2468.1811
SMILESCCN(CC)c1ccc2c(-c3ccccc3C(=O)N[C@@H](CCCCN)C(=O)N(CCC(=O)N[C@@H](CCCCN)C(=O)N(CCC(=O)N[C@@H](CCCCN)C(=O)N(CCC(=O)N[C@@H](CCCCN)C(=O)N(CCC(=O)N[C@@H](CCCCN)C(=O)N(CCC(=O)N[C@@H](CCCCN)C(=O)N(CCC(=O)N[C@@H](CCCCN)C(=O)N(CCC(N)=O)Cc3ccccc3)Cc3ccccc3)Cc3ccccc3)Cc3ccccc3)Cc3ccccc3)Cc3ccccc3)Cc3ccccc3)c3ccc(cc3oc2c1)=[N+](CC)CC