Reaction Details
TargetATP-dependent translocase ABCB1
LigandBDBM50238969
Substrate/Competitorn/a
Meas. Tech.ChEMBL_1664684 (CHEMBL4014480)
IC50 11±n/a nM
Citation Murahari, MKharkar, PSLonikar, NMayur, YC Design, synthesis, biological evaluation, molecular docking and QSAR studies of 2,4-dimethylacridones as anticancer agents. Eur J Med Chem130:154-170 (2017) 
 
ATP-dependent translocase ABCB1
Name:ATP-dependent translocase ABCB1
Type:Protein
Mol. Mass.:141503.50
Organism:Homo sapiens (Human)
Description:P08183
Residue:1280
BDBM50238969
NameBDBM50238969
Synonyms:CHEMBL4096764
TypeSmall organic molecule
Emp. Form.C22H28N2O3
Mol. Mass.368.4693
SMILESCc1cc(C)c2n(CCCN(CCO)CCO)c3ccccc3c(=O)c2c1