Reaction Details
TargetHistone deacetylase 8
LigandBDBM50380399
Substrate/Competitorn/a
Meas. Tech.ChEMBL_1664931 (CHEMBL4014727)
IC50 1479±n/a nM
Citation Ballante, FReddy, DRZhou, NJMarshall, GR Structural insights of SmKDAC8 inhibitors: Targeting Schistosoma epigenetics through a combined structure-based 3D QSAR, in vitro and synthesis strategy. Bioorg Med Chem25:2105-2132 (2017) 
 
Histone deacetylase 8
Name:Histone deacetylase 8
Type:PROTEIN
Mol. Mass.:49771.73
Organism:Schistosoma mansoni
Description:ChEMBL_116785
Residue:440
BDBM50380399
NameBDBM50380399
Synonyms:CHEMBL2018302 US10227295, Compound Tubastatin A US11207431, Example D US9249087, Tubacin US9956192, Compound Tubastatin-A
TypeSmall organic molecule
Emp. Form.C20H21N3O2
Mol. Mass.335.3996
SMILESCN1CCc2c(C1)c1ccccc1n2Cc1ccc(cc1)C(=O)NO