Reaction Details
TargetD(3) dopamine receptor
LigandBDBM50040241
Substrate/Competitorn/a
Ki 254.7±n/a nM
CommentsPDSP_836
Citation Boundy, VALuedtke, RRGallitano, ALSmith, JEFiltz, TMKallen, RGMolinoff, PB Expression and characterization of the rat D3 dopamine receptor: pharmacologic properties and development of antibodies. J Pharmacol Exp Ther264:1002-11 (1993) D(3) dopamine receptor
Name:D(3) dopamine receptor
Type:Protein
Mol. Mass.:49540.58
Organism:Rattus norvegicus (Rat)
Description:P19020
Residue:446
BDBM50040241
NameBDBM50040241
Synonyms:3-Fluoro-6-(4-methyl-piperazin-1-yl)-11H-dibenzo[b,e]azepine CHEMBL63756 | Fluperlapine
TypeSmall organic molecule
Emp. Form.C19H20FN3
Mol. Mass.309.3806
SMILESCN1CCN(CC1)C1=Nc2cc(F)ccc2Cc2ccccc12