Reaction Details
Target5-hydroxytryptamine receptor 5A
LigandBDBM35234
Substrate/Competitorn/a
Ki>10000±n/a nM
CommentsPDSP_1348
Citation Matthes, HBoschert, UAmlaiky, NGrailhe, RPlassat, JLMuscatelli, FMattei, MGHen, R Mouse 5-hydroxytryptamine5A and 5-hydroxytryptamine5B receptors define a new family of serotonin receptors: cloning, functional expression, and chromosomal localization. Mol Pharmacol43:313-9 (1993) 5-hydroxytryptamine receptor 5A
Name:5-hydroxytryptamine receptor 5A
Type:Enzyme Catalytic Domain
Mol. Mass.:40749.33
Organism:MOUSE
Description:5-HT5 0 MOUSE::P30966
Residue:357
BDBM35234
NameBDBM35234
Synonyms:DL-[7-3H]norepinephrine Noradrenaline,(+) | [3H]NE
Typeradiolabeled ligand
Emp. Form.C8H11NO3
Mol. Mass.169.1778
SMILESNCC(O)c1ccc(O)c(O)c1