Reaction Details
TargetCasein kinase I isoform epsilon
LigandBDBM274492
Substrate/Competitorn/a
Meas. Tech.Kinase Assay
pH7.4±n/a
Temperature298.15±n/a K
IC50 1.26±n/a nM
Commentsextracted
Citation Velaparthi, UDarne, CPDodd, DSSampognaro, AJWittman, MDKumaravel, SMullick, DLiu, PRachamreddy, CR Substituted imidazoles as casein kinase 1 D/E inhibitors US Patent US9556179 Publication Date 1/31/2017
 
Casein kinase I isoform epsilon
Name:Casein kinase I isoform epsilon
Type:Protein
Mol. Mass.:47340.25
Organism:Homo sapiens (Human)
Description:P49674
Residue:416
BDBM274492
NameBDBM274492
Synonyms:2-fluoro-N-(6-(4-(4-fluorophenyl)-1-(1- (2-morpholinoacetyl)piperidin-4-yl)-1H- imidazol-5-yl)imidazo[1,2-b]pyridazin- 2-yl)isonicotinamide | US9556179, Compound 61
TypeSmall organic molecule
Emp. Form.C32H31F2N9O3
Mol. Mass.627.6438
SMILESFc1ccc(cc1)-c1ncn(C2CCN(CC2)C(=O)CN2CCOCC2)c1-c1ccc2nc(NC(=O)c3ccnc(F)c3)cn2n1