Reaction Details
TargetCasein kinase I isoform epsilon
LigandBDBM274495
Substrate/Competitorn/a
Meas. Tech.Kinase Assay
pH7.4±n/a
Temperature298.15±n/a K
IC50 0.798±n/a nM
Commentsextracted
Citation Velaparthi, UDarne, CPDodd, DSSampognaro, AJWittman, MDKumaravel, SMullick, DLiu, PRachamreddy, CR Substituted imidazoles as casein kinase 1 D/E inhibitors US Patent US9556179 Publication Date 1/31/2017
 
Casein kinase I isoform epsilon
Name:Casein kinase I isoform epsilon
Type:Protein
Mol. Mass.:47340.25
Organism:Homo sapiens (Human)
Description:P49674
Residue:416
BDBM274495
NameBDBM274495
Synonyms:2-fluoro-N-(6-(1-(1-(2-fluoro-2- methylpropanoyl)piperidin-4-yl)-4-(4- fluorophenyl)-1H-imidazol-5- yl)imidazo[1,2-6]pyridazin-2- yl)isonicotinamide | US9556179, Compound 64
TypeSmall organic molecule
Emp. Form.C30H27F3N8O2
Mol. Mass.588.583
SMILESCC(C)(F)C(=O)N1CCC(CC1)n1cnc(c1-c1ccc2nc(NC(=O)c3ccnc(F)c3)cn2n1)-c1ccc(F)cc1