Reaction Details
TargetCasein kinase I isoform epsilon
LigandBDBM274513
Substrate/Competitorn/a
Meas. Tech.Kinase Assay
pH7.4±n/a
Temperature298.15±n/a K
IC50 0.461±n/a nM
Commentsextracted
Citation Velaparthi, UDarne, CPDodd, DSSampognaro, AJWittman, MDKumaravel, SMullick, DLiu, PRachamreddy, CR Substituted imidazoles as casein kinase 1 D/E inhibitors US Patent US9556179 Publication Date 1/31/2017
 
Casein kinase I isoform epsilon
Name:Casein kinase I isoform epsilon
Type:Protein
Mol. Mass.:47340.25
Organism:Homo sapiens (Human)
Description:P49674
Residue:416
BDBM274513
NameBDBM274513
Synonyms:3,3,3-trifluoropropyl 4-(5-(2-(2- fluoroisonicotinamido)imidazo[1,2- b]pyridazin-6-yl)-4-(4-fluorophenyl)- 1H-imidazol-1-yl)piperidine-1- carboxylate | US9556179, Compound 83
TypeSmall organic molecule
Emp. Form.C30H25F5N8O3
Mol. Mass.640.5633
SMILESFc1ccc(cc1)-c1ncn(C2CCN(CC2)C(=O)OCCC(F)(F)F)c1-c1ccc2nc(NC(=O)c3ccnc(F)c3)cn2n1