Reaction Details
TargetCasein kinase I isoform epsilon
LigandBDBM274545
Substrate/Competitorn/a
Meas. Tech.Kinase Assay
pH7.4±n/a
Temperature298.15±n/a K
IC50 0.372±n/a nM
Commentsextracted
Citation Velaparthi, UDarne, CPDodd, DSSampognaro, AJWittman, MDKumaravel, SMullick, DLiu, PRachamreddy, CR Substituted imidazoles as casein kinase 1 D/E inhibitors US Patent US9556179 Publication Date 1/31/2017
 
Casein kinase I isoform epsilon
Name:Casein kinase I isoform epsilon
Type:Protein
Mol. Mass.:47340.25
Organism:Homo sapiens (Human)
Description:P49674
Residue:416
BDBM274545
NameBDBM274545
Synonyms:N-(6-(4-(4-fluorophenyl)-1-(1-(isoxazole-3-carbonyl)piperidin-4-yl)-1H-imidazol-5-yl)imidazo[1,2-b]pyridazin-2-yl)thiazole-5-carboxamide | US9556179, Compound 116
TypeSmall organic molecule
Emp. Form.C28H22FN9O3S
Mol. Mass.583.596
SMILESFc1ccc(cc1)-c1ncn(C2CCN(CC2)C(=O)c2ccon2)c1-c1ccc2nc(NC(=O)c3cncs3)cn2n1