Reaction Details
TargetCasein kinase I isoform epsilon
LigandBDBM274618
Substrate/Competitorn/a
Meas. Tech.Kinase Assay
pH7.4±n/a
Temperature298.15±n/a K
IC50 1.06±n/a nM
Commentsextracted
Citation Velaparthi, UDarne, CPDodd, DSSampognaro, AJWittman, MDKumaravel, SMullick, DLiu, PRachamreddy, CR Substituted imidazoles as casein kinase 1 D/E inhibitors US Patent US9556179 Publication Date 1/31/2017
 
Casein kinase I isoform epsilon
Name:Casein kinase I isoform epsilon
Type:Protein
Mol. Mass.:47340.25
Organism:Homo sapiens (Human)
Description:P49674
Residue:416
BDBM274618
NameBDBM274618
Synonyms:N-(6-(2-(4-fluorophenyl) imidazo[1,2-a]pyridin-3-yl) imidazo[1,2-b]pyridazin-2-yl)- 2-pivalamidoisonicotinamide | US9556179, Compound 192
TypeSmall organic molecule
Emp. Form.C30H25FN8O2
Mol. Mass.548.5703
SMILESCC(C)(C)C(=O)Nc1cc(ccn1)C(=O)Nc1cn2nc(ccc2n1)-c1c(nc2ccccn12)-c1ccc(F)cc1