Reaction Details
TargetCasein kinase I isoform epsilon
LigandBDBM274663
Substrate/Competitorn/a
Meas. Tech.Kinase Assay
pH7.4±n/a
Temperature298.15±n/a K
IC50 0.412±n/a nM
Commentsextracted
Citation Velaparthi, UDarne, CPDodd, DSSampognaro, AJWittman, MDKumaravel, SMullick, DLiu, PRachamreddy, CR Substituted imidazoles as casein kinase 1 D/E inhibitors US Patent US9556179 Publication Date 1/31/2017
 
Casein kinase I isoform epsilon
Name:Casein kinase I isoform epsilon
Type:Protein
Mol. Mass.:47340.25
Organism:Homo sapiens (Human)
Description:P49674
Residue:416
BDBM274663
NameBDBM274663
Synonyms:2-fluoro-N-(6-(1-(2-fluoroethyl)-4- (4-fluorophenyl)-1H-imidazol-5-yl) imidazo[1,2-b]pyridazin-2-yl)iso- nicotinamide | US9556179, Compound 238
TypeSmall organic molecule
Emp. Form.C23H16F3N7O
Mol. Mass.463.4146
SMILESFCCn1cnc(c1-c1ccc2nc(NC(=O)c3ccnc(F)c3)cn2n1)-c1ccc(F)cc1