Reaction Details
TargetCasein kinase I isoform delta
LigandBDBM274763
Substrate/Competitorn/a
Meas. Tech.Kinase Assay
pH7.4±n/a
Temperature298.15±n/a K
IC50 0.187±n/a nM
Commentsextracted
Citation Velaparthi, UDarne, CPDodd, DSSampognaro, AJWittman, MDKumaravel, SMullick, DLiu, PRachamreddy, CR Substituted imidazoles as casein kinase 1 D/E inhibitors US Patent US9556179 Publication Date 1/31/2017
 
Casein kinase I isoform delta
Name:Casein kinase I isoform delta
Type:Enzyme
Mol. Mass.:47356.76
Organism:Homo sapiens (Human)
Description:P48730
Residue:415
BDBM274763
NameBDBM274763
Synonyms:N-(6-(4-(4-fluorophenyl)-1,2- dimethyl-1H-imidazol-5-yl) imidazo[1,2-b]pyridazin-2- yl)isoquinoline-6- carboxamide | US9556179, Compound 339
TypeSmall organic molecule
Emp. Form.C27H20FN7O
Mol. Mass.477.4924
SMILESCc1nc(c(-c2ccc3nc(NC(=O)c4ccc5cnccc5c4)cn3n2)n1C)-c1ccc(F)cc1