Reaction Details
TargetCannabinoid receptor 1
LigandBDBM84882
Substrate/Competitorn/a
Ki 171±n/a nM
CommentsPDSP_929
Citation Compton, DRRice, KCDe Costa, BRRazdan, RKMelvin, LSJohnson, MRMartin, BR Cannabinoid structure-activity relationships: correlation of receptor binding and in vivo activities. J Pharmacol Exp Ther265:218-26 (1993) Cannabinoid receptor 1
Name:Cannabinoid receptor 1
Type:G Protein-Coupled Receptor (GPCR)
Mol. Mass.:52856.55
Organism:Rattus norvegicus (rat)
Description:P20272
Residue:473
BDBM84882
NameBDBM84882
Synonyms:CAS_169742 HHC. 9 alpha-OH | NSC_169742
TypeSmall organic molecule
Emp. Form.C21H32O3
Mol. Mass.332.477
SMILESCCCCCc1cc(O)c2C3CC(C)(O)CCC3C(C)(C)Oc2c1