Reaction Details
TargetCannabinoid receptor 1
LigandBDBM84880
Substrate/Competitorn/a
Ki 820±n/a nM
CommentsPDSP_1833
Citation Compton, DRRice, KCDe Costa, BRRazdan, RKMelvin, LSJohnson, MRMartin, BR Cannabinoid structure-activity relationships: correlation of receptor binding and in vivo activities. J Pharmacol Exp Ther265:218-26 (1993) Cannabinoid receptor 1
Name:Cannabinoid receptor 1
Type:G Protein-Coupled Receptor (GPCR)
Mol. Mass.:52856.55
Organism:Rattus norvegicus (rat)
Description:P20272
Residue:473
BDBM84880
NameBDBM84880
Synonyms:THC, 8 beta-OH
TypeSmall organic molecule
Emp. Form.C21H30O3
Mol. Mass.330.4611
SMILESCCCCCc1cc(O)c2[C@@H]3C=C(C)[C@H](O)C[C@H]3C(C)(C)Oc2c1