Reaction Details
TargetCannabinoid receptor 1
LigandBDBM50287934
Substrate/Competitorn/a
Ki 236±n/a nM
CommentsPDSP_1839
Citation Compton, DRRice, KCDe Costa, BRRazdan, RKMelvin, LSJohnson, MRMartin, BR Cannabinoid structure-activity relationships: correlation of receptor binding and in vivo activities. J Pharmacol Exp Ther265:218-26 (1993) Cannabinoid receptor 1
Name:Cannabinoid receptor 1
Type:G Protein-Coupled Receptor (GPCR)
Mol. Mass.:52856.55
Organism:Rattus norvegicus (rat)
Description:P20272
Residue:473
BDBM50287934
NameBDBM50287934
Synonyms:(6aR,10aR)-3-(1,1-Dimethyl-heptyl)-6,6-dimethyl-9-methylene-6a,7,8,9,10,10a-hexahydro-6H-benzo[c]chromen-1-ol THC, delta 9, 11
TypeSmall organic molecule
Emp. Form.C25H38O2
Mol. Mass.370.568
SMILESCCCCCCC(C)(C)c1cc(O)c2[C@@H]3CC(=C)CC[C@H]3C(C)(C)Oc2c1