Reaction Details
TargetCannabinoid receptor 1
LigandBDBM84889
Substrate/Competitorn/a
Ki 1990±n/a nM
CommentsPDSP_1844
Citation Compton, DRRice, KCDe Costa, BRRazdan, RKMelvin, LSJohnson, MRMartin, BR Cannabinoid structure-activity relationships: correlation of receptor binding and in vivo activities. J Pharmacol Exp Ther265:218-26 (1993) Cannabinoid receptor 1
Name:Cannabinoid receptor 1
Type:G Protein-Coupled Receptor (GPCR)
Mol. Mass.:52856.55
Organism:Rattus norvegicus (rat)
Description:P20272
Residue:473
BDBM84889
NameBDBM84889
Synonyms:THC, 11-OH-delta 8 | THC-DMH, (+)-11-OH
TypeSmall organic molecule
Emp. Form.C25H38O3
Mol. Mass.386.5674
SMILESCCCCCCC(C)(C)c1cc(O)c2[C@@H]3C=C(CO)CC[C@H]3C(C)(C)Oc2c1