Reaction Details
TargetSomatostatin receptor type 2
LigandBDBM81766
Substrate/Competitorn/a
Ki 0.07±n/a nM
CommentsPDSP_1242
Citation Reisine, TBell, GI Molecular biology of somatostatin receptors. Endocr Rev16:427-42 (1995) 
 
Somatostatin receptor type 2
Name:Somatostatin receptor type 2
Type:Enzyme
Mol. Mass.:41344.94
Organism:Homo sapiens (Human)
Description:P30874
Residue:369
BDBM81766
NameBDBM81766
Synonyms:CAS_3086456 NSC_3086456
TypeSmall organic molecule
Emp. Form.C44H56N8O7
Mol. Mass.808.9648
SMILESCC(C)C1NC(=O)C(CCCCN)NC(=O)C(Cc2c[nH]c3ccccc23)NC(=O)C(Cc2ccc(O)cc2)NC(=O)C(C)N(C)C(=O)C(Cc2ccccc2)NC1=O