Reaction Details
Target5-hydroxytryptamine receptor 6
LigandBDBM50040241
Substrate/Competitorn/a
Ki 29±n/a nM
CommentsPDSP_836
Citation Kohen, RMetcalf, MAKhan, NDruck, THuebner, KLachowicz, JEMeltzer, HYSibley, DRRoth, BLHamblin, MW Cloning, characterization, and chromosomal localization of a human 5-HT6 serotonin receptor. J Neurochem66:47-56 (1996) 
 
5-hydroxytryptamine receptor 6
Name:5-hydroxytryptamine receptor 6
Type:G Protein-Coupled Receptor (GPCR)
Mol. Mass.:46968.43
Organism:Homo sapiens (Human)
Description:P50406
Residue:440
BDBM50040241
NameBDBM50040241
Synonyms:3-Fluoro-6-(4-methyl-piperazin-1-yl)-11H-dibenzo[b,e]azepine CHEMBL63756 | Fluperlapine
TypeSmall organic molecule
Emp. Form.C19H20FN3
Mol. Mass.309.3806
SMILESCN1CCN(CC1)C1=Nc2cc(F)ccc2Cc2ccccc12