Reaction Details
Target5-hydroxytryptamine receptor 6
LigandBDBM50014407
Substrate/Competitorn/a
Ki 3600±n/a nM
CommentsPDSP_1578
Citation Kohen, RMetcalf, MAKhan, NDruck, THuebner, KLachowicz, JEMeltzer, HYSibley, DRRoth, BLHamblin, MW Cloning, characterization, and chromosomal localization of a human 5-HT6 serotonin receptor. J Neurochem66:47-56 (1996) 
 
5-hydroxytryptamine receptor 6
Name:5-hydroxytryptamine receptor 6
Type:G Protein-Coupled Receptor (GPCR)
Mol. Mass.:46968.43
Organism:Homo sapiens (Human)
Description:P50406
Residue:440
BDBM50014407
NameBDBM50014407
Synonyms:2-(piperazin-1-yl)quinoline 2-Piperazin-1-yl-quinoline (Quipazine) CHEMBL18772 | QUIPAZINE
TypeSmall organic molecule
Emp. Form.C13H15N3
Mol. Mass.213.2783
SMILESC1CN(CCN1)c1ccc2ccccc2n1