Reaction Details
Target5-hydroxytryptamine receptor 6
LigandBDBM50007406
Substrate/Competitorn/a
Ki 430±n/a nM
CommentsPDSP_1808
Citation Kohen, RMetcalf, MAKhan, NDruck, THuebner, KLachowicz, JEMeltzer, HYSibley, DRRoth, BLHamblin, MW Cloning, characterization, and chromosomal localization of a human 5-HT6 serotonin receptor. J Neurochem66:47-56 (1996) 
 
5-hydroxytryptamine receptor 6
Name:5-hydroxytryptamine receptor 6
Type:G Protein-Coupled Receptor (GPCR)
Mol. Mass.:46968.43
Organism:Homo sapiens (Human)
Description:P50406
Residue:440
BDBM50007406
NameBDBM50007406
Synonyms:1-(3-(trifluoromethyl)phenyl)piperazine 1-(3-Trifluoromethyl-phenyl)-piperazine(TFMPP) TFMPP
TypeSmall organic molecule
Emp. Form.C11H13F3N2
Mol. Mass.230.2295
SMILESFC(F)(F)c1cccc(c1)N1CCNCC1