Reaction Details
TargetD(2) dopamine receptor
LigandBDBM50131440
Substrate/Competitorn/a
Ki 5±n/a nM
CommentsPDSP_1205
Citation Roth, BLTandra, SBurgess, LHSibley, DRMeltzer, HY D4 dopamine receptor binding affinity does not distinguish between typical and atypical antipsychotic drugs. Psychopharmacology (Berl)120:365-8 (1995) 
 
D(2) dopamine receptor
Name:D(2) dopamine receptor
Type:G Protein-Coupled Receptor (GPCR)
Mol. Mass.:50931.60
Organism:Rattus norvegicus (rat)
Description:P61169
Residue:444
BDBM50131440
NameBDBM50131440
Synonyms:10-(2-(1-methylpiperidin-2-yl)ethyl)-2-(methylsulfinyl)-10H-phenothiazine CHEMBL1088 NC-123 TPS-23
TypeSmall organic molecule
Emp. Form.C21H26N2OS2
Mol. Mass.386.574
SMILESCN1CCCCC1CCN1c2ccccc2Sc2ccc(cc12)S(C)=O