Reaction Details
TargetD(4) dopamine receptor
LigandBDBM50026066
Substrate/Competitorn/a
Ki 31±n/a nM
CommentsPDSP_1448
Citation Roth, BLTandra, SBurgess, LHSibley, DRMeltzer, HY D4 dopamine receptor binding affinity does not distinguish between typical and atypical antipsychotic drugs. Psychopharmacology (Berl)120:365-8 (1995) 
 
D(4) dopamine receptor
Name:D(4) dopamine receptor
Type:Enzyme Catalytic Domain
Mol. Mass.:41307.65
Organism:RAT
Description:DOPAMINE D4.4 0 RAT::P30729
Residue:387
BDBM50026066
NameBDBM50026066
Synonyms:1-(4,4-bis(4-fluorophenyl)butyl)-4-(4-chloro-3-(trifluoromethyl)phenyl)piperidin-4-ol CHEMBL47050 Penfluridol
TypeSmall organic molecule
Emp. Form.C28H27ClF5NO
Mol. Mass.523.965
SMILESOC1(CCN(CCCC(c2ccc(F)cc2)c2ccc(F)cc2)CC1)c1ccc(Cl)c(c1)C(F)(F)F