Reaction Details
TargetD(4) dopamine receptor
LigandBDBM50102325
Substrate/Competitorn/a
Ki 7.9±n/a nM
CommentsPDSP_1455
Citation Roth, BLTandra, SBurgess, LHSibley, DRMeltzer, HY D4 dopamine receptor binding affinity does not distinguish between typical and atypical antipsychotic drugs. Psychopharmacology (Berl)120:365-8 (1995) 
 
D(4) dopamine receptor
Name:D(4) dopamine receptor
Type:Enzyme Catalytic Domain
Mol. Mass.:41307.65
Organism:RAT
Description:DOPAMINE D4.4 0 RAT::P30729
Residue:387
BDBM50102325
NameBDBM50102325
Synonyms:6-(4-Methyl-piperazin-1-yl)-11H-dibenzo[b,e]azepine Perlapine
TypeSmall organic molecule
Emp. Form.C19H21N3
Mol. Mass.291.3901
SMILESCN1CCN(CC1)C1=Nc2ccccc2Cc2ccccc12