Reaction Details
TargetGlutamate receptor ionotropic, NMDA 1
LigandBDBM50289498
Substrate/Competitorn/a
Ki>10000±n/a nM
CommentsPDSP_1293
Citation Shimizu-Sasamata, MKawasaki-Yatsugi, SOkada, MSakamoto, SYatsugi, STogami, JHatanaka, KOhmori, JKoshiya, KUsuda, SMurase, K YM90K: pharmacological characterization as a selective and potent alpha-amino-3-hydroxy-5-methylisoxazole-4-propionate/kainate receptor antagonist. J Pharmacol Exp Ther276:84-92 (1996) Glutamate receptor ionotropic, NMDA 1
Name:Glutamate receptor ionotropic, NMDA 1
Type:Enzyme Catalytic Domain
Mol. Mass.:105533.40
Organism:RAT
Description:P35439
Residue:938
BDBM50289498
NameBDBM50289498
Synonyms:3-Hydroxy-6-nitro-7-sulfamoyl-benzo[f]quinoxalin-2-ol anion | NBQX
TypeSmall organic molecule
Emp. Form.C12H7N4O6S
Mol. Mass.335.273
SMILESNS(=O)(=O)c1cccc2c1c(cc1[n-]c(=[OH+])c(=O)[n-]c21)[N+]([O-])=O