Reaction Details
Target5-hydroxytryptamine receptor 2A
LigandBDBM50001859
Substrate/Competitorn/a
Ki 870.96±n/a nM
CommentsPDSP_446
Citation Borsini, FGiraldo, EMonferini, EAntonini, GParenti, MBietti, GDonetti, A BIMT 17, a 5-HT2A receptor antagonist and 5-HT1A receptor full agonist in rat cerebral cortex. Naunyn Schmiedebergs Arch Pharmacol352:276-82 (1995) 
 
5-hydroxytryptamine receptor 2A
Name:5-hydroxytryptamine receptor 2A
Type:G Protein-Coupled Receptor (GPCR)
Mol. Mass.:52852.05
Organism:Rattus norvegicus (rat)
Description:Rat cortex membranes 5-HT2A receptors.
Residue:471
BDBM50001859
NameBDBM50001859
Synonyms:(buspirone) 8-[4-(4-Pyrimidin-2-yl-piperazin-1-yl)-butyl]-8-aza-spiro[4.5]decane-7,9-dione 8-[4-(4-Pyrimidin-2-yl-piperazin-1-yl)-butyl]-8-aza-spiro[4.5]decane-7,9-dione; Hydrochloride(Buspirone) BUSPAR CHEMBL49 | US10562853, Compound Buspirone
TypeSmall organic molecule
Emp. Form.C21H31N5O2
Mol. Mass.385.5031
SMILESO=C1CC2(CCCC2)CC(=O)N1CCCCN1CCN(CC1)c1ncccn1