Reaction Details
Target5-hydroxytryptamine receptor 2C
LigandBDBM84952
Substrate/Competitorn/a
Ki 3981.07±n/a nM
CommentsPDSP_3125
Citation Borsini, FGiraldo, EMonferini, EAntonini, GParenti, MBietti, GDonetti, A BIMT 17, a 5-HT2A receptor antagonist and 5-HT1A receptor full agonist in rat cerebral cortex. Naunyn Schmiedebergs Arch Pharmacol352:276-82 (1995) 
 
5-hydroxytryptamine receptor 2C
Name:5-hydroxytryptamine receptor 2C
Type:Enzyme
Mol. Mass.:51935.10
Organism:Rattus norvegicus (Rat)
Description:P08909
Residue:460
BDBM84952
NameBDBM84952
Synonyms:BIMT 17 NSC_127941
TypeSmall organic molecule
Emp. Form.C20H21F3N4O
Mol. Mass.390.4021
SMILESFC(F)(F)c1ccc(cc1)N1CCN(CCn2c3ccccc3[nH]c2=O)CC1