Reaction Details
Target5-hydroxytryptamine receptor 3A
LigandBDBM50241143
Substrate/Competitorn/a
Ki 0.8±n/a nM
CommentsPDSP_1179
Citation Borsini, FGiraldo, EMonferini, EAntonini, GParenti, MBietti, GDonetti, A BIMT 17, a 5-HT2A receptor antagonist and 5-HT1A receptor full agonist in rat cerebral cortex. Naunyn Schmiedebergs Arch Pharmacol352:276-82 (1995) 
 
5-hydroxytryptamine receptor 3A
Name:5-hydroxytryptamine receptor 3A
Type:Enzyme Catalytic Domain
Mol. Mass.:55428.70
Organism:RAT
Description:5-HT3 HTR3A RAT::P35563
Residue:483
BDBM50241143
NameBDBM50241143
Synonyms:(MDL 72222)3,5-Dichloro-benzoic acid 8-methyl-8-aza-bicyclo[3.2.1]oct-3-yl ester 3,5-Dichloro-benzoic acid 8-methyl-8-aza-bicyclo[3.2.1]oct-3-yl ester (MDL 72222) 3,5-Dichloro-benzoic acid 8-methyl-8-aza-bicyclo[3.2.1]oct-3-yl ester(MDL-72222) 3alpha-(3',5'-dichlorobenzoyloxy)tropane MDL 72222 [2-(5-Hydroxy-1H-indol-3-yl)-ethyl]-trimethyl-ammonium
TypeSmall organic molecule
Emp. Form.C15H17Cl2NO2
Mol. Mass.314.207
SMILESCN1C2CCC1CC(C2)OC(=O)c1cc(Cl)cc(Cl)c1