Reaction Details
TargetSomatostatin receptor type 3
LigandBDBM50065453
Substrate/Competitorn/a
Ki 125.89±n/a nM
CommentsPDSP_1035
Citation Bruns, CRaulf, FHoyer, DSchloos, JLübbert, HWeckbecker, G Binding properties of somatostatin receptor subtypes. Metab Clin Exp45:17-20 (1996) 
 
Somatostatin receptor type 3
Name:Somatostatin receptor type 3
Type:Protein
Mol. Mass.:45855.97
Organism:Homo sapiens (Human)
Description:P32745
Residue:418
BDBM50065453
NameBDBM50065453
Synonyms:(5S,8S,11S,14R,17S,19aS)-11-(4-Amino-butyl)-5,17-dibenzyl-8-((R)-1-hydroxy-ethyl)-14-(1H-indol-3-ylmethyl)-tetradecahydro-3a,6,9,12,15,18-hexaaza-cyclopentacyclooctadecene-4,7,10,13,16,19-hexaone L-361,301 L-363301
TypeSmall organic molecule
Emp. Form.C44H54N8O7
Mol. Mass.806.949
SMILESC[C@@H](O)[C@@H]1NC(=O)[C@H](CCCCN)NC(=O)[C@@H](Cc2c[nH]c3ccccc23)NC(=O)[C@H](Cc2ccccc2)NC(=O)[C@@H]2CCCN2C(=O)[C@H](Cc2ccccc2)NC1=O