Reaction Details
Target5-hydroxytryptamine receptor 2C
LigandBDBM82272
Substrate/Competitorn/a
Ki 125.89±n/a nM
CommentsPDSP_7268
Citation Baxter, GS Novel discriminatory ligands for 5-HT2B receptors. Behav Brain Res73:149-52 (1996) 
 
5-hydroxytryptamine receptor 2C
Name:5-hydroxytryptamine receptor 2C
Type:Enzyme
Mol. Mass.:51935.10
Organism:Rattus norvegicus (Rat)
Description:P08909
Residue:460
BDBM82272
NameBDBM82272
Synonyms:SB 200646 | SB200646a
Typen/a
Emp. Form.C15H14N4O
Mol. Mass.266.2979
SMILESCn1ccc2cc(NC(=O)Nc3cccnc3)ccc12