Reaction Details
TargetD(1A) dopamine receptor
LigandBDBM82272
Substrate/Competitorn/a
Ki>10000±n/a nM
CommentsPDSP_7268
Citation Baxter, GS Novel discriminatory ligands for 5-HT2B receptors. Behav Brain Res73:149-52 (1996) 
 
D(1A) dopamine receptor
Name:D(1A) dopamine receptor
Type:Enzyme Catalytic Domain
Mol. Mass.:49429.75
Organism:RAT
Description:P18901
Residue:446
BDBM82272
NameBDBM82272
Synonyms:SB 200646 | SB200646a
Typen/a
Emp. Form.C15H14N4O
Mol. Mass.266.2979
SMILESCn1ccc2cc(NC(=O)Nc3cccnc3)ccc12