Reaction Details
Target5-hydroxytryptamine receptor 3A
LigandBDBM79215
Substrate/Competitorn/a
Ki 6309.57±n/a nM
CommentsPDSP_882
Citation Skingle, MBeattie, DTScopes, DIStarkey, SJConnor, HEFeniuk, WTyers, MB GR127935: a potent and selective 5-HT1D receptor antagonist. Behav Brain Res73:157-61 (1996) 
 
5-hydroxytryptamine receptor 3A
Name:5-hydroxytryptamine receptor 3A
Type:Enzyme Catalytic Domain
Mol. Mass.:55428.70
Organism:RAT
Description:5-HT3 HTR3A RAT::P35563
Residue:483
BDBM79215
NameBDBM79215
Synonyms:CHEMBL15928 GR 127935 hydrochloride hydrate N-[4-methoxy-3-(4-methyl-1-piperazinyl)phenyl]-4-[2-methyl-4-(5-methyl-1,2,4-oxadiazol-3-yl)phenyl]benzamide;hydrochloride N-[4-methoxy-3-(4-methylpiperazino)phenyl]-4-[2-methyl-4-(5-methyl-1,2,4-oxadiazol-3-yl)phenyl]benzamide;hydrochloride cid_11497466
TypeSmall organic molecule
Emp. Form.C29H31N5O3
Mol. Mass.497.5881
SMILESCOc1ccc(NC(=O)c2ccc(cc2)-c2ccc(cc2C)-c2noc(C)n2)cc1N1CCN(C)CC1